Cyber Security
label: Datenverarbeitungssystem / Sicherheit @de
label: Computer / Sicherheit @de
label: Cybersecurity @de
label: Computersicherheit @de
label: IT-Sicherheit @de
label: Cybersicherheit @de

IT crime
type: Concept
type: Descriptor
related: Computer virus
label: Computerkriminalität @de
label: Cyberangriff @de
label: Cyber attack
label: Internetkriminalität @de
label: Cybercrime
label: Net crime
label: Cyberkriminalität @de
label: Cyberattacke @de
label: IT-Kriminalität @de
label: Computer crime
label: Cyber crime
label: Internet crime

Computer virus
altLabelNarrower: Computer virus
altLabelNarrower: Antiviren-Programm @de
altLabelNarrower: Computersicherheit @de
altLabelNarrower: Viren-Scanner @de
label: Cybersecurity
label: Hacker @de
label: Softwarevirus @de
label: Antiviren-Programm @de
label: Viren-Scanner @de
label: IT-Sicherheit @de
label: Computersicherheit @de
label: Computervirus @de
label: Cybersicherheit @de
type: Descriptor
type: Concept
broader: Information security
broader: B.09.02 IS development and management
broader: Information technology and systems architecture
is in scheme: STW Thesaurus for Economics
gvkppn: 182244618X
is part of: STW Thesaurus for Economics
useInsteadNote: Bis 2022 für Literaturrecherche
useInsteadNote: Until 2022 to search for literature
scope note: Protection of a computer system against failure manipulation and unauthorized access
scope note: Sicherheit eines Computersystems vor Ausfall, Manipulation und unerlaubtem Zugriff @de
related: IT crime
related: Data security
altLabelRelated: Hacker @de
altLabelRelated: Computervirus @de
altLabelRelated: Softwarevirus @de

has broader
sub property of: broaderTransitive
definition: Relates a concept to a concept that is more general in meaning.
comment: Broader concepts are typically rendered as parents in a concept hierarchy (tree).

altLabelNarrower
definition: Lexical label for a narrower term which is not defined as a separate concept (according to ISO 25964, 8.4), sometimes referred to as 'upward posting'. Intended for use with skos:Concept, instead of using skos:altLabel.

altLabelRelated
definition: Lexical label for a related term which is not defined as a separate concept. Intended for use with skos:Concept, instead of using skos:altLabel.

B.09.02 IS development and management
preferred label: B.09.02 IS-Entwicklung und -Betrieb @de
narrower: Computer virus
label: IS development and management
label: IS-Entwicklung und -Betrieb @de
type: Thsys
type: Concept
notation: B.09.02

Data security
label: Datensicherung @de
label: Datenverschlüsselung @de
label: Datensicherheit @de
label: Verschlüsselung von Daten @de
label: Data backup
type: Descriptor
type: Concept
related: Computer virus

Information security
label: Sicherheit in der Informationstechnik @de
label: Infosecurity
label: Informationssicherheit @de
label: Infosec
narrower: Computer virus
type: Descriptor
type: Concept

alternative label
sub property of: label
definition: An alternative lexical label for a resource.
comment: skos:prefLabel, skos:altLabel and skos:hiddenLabel are pairwise disjoint properties.
comment: The range of skos:altLabel is the class of RDF plain literals.

Information technology and systems architecture
label: Informationstechnik und Systemarchitektur @de
label: N.10.05.01 Informationstechnik und Systemarchitektur @de
label: N.10.05.01 Information technology and systems architecture
type: Concept
type: Thsys
notation: N.10.05.01
narrower: Computer virus

preferred label
sub property of: label
definition: The preferred lexical label for a resource, in a given language.
comment: skos:prefLabel, skos:altLabel and skos:hiddenLabel are pairwise disjoint properties.
comment: The range of skos:prefLabel is the class of RDF plain literals.
comment: A resource has no more than one value of skos:prefLabel per language tag.

has exact match
sub property of: closeMatch
definition: skos:exactMatch is used to link two concepts, indicating a high degree of confidence that the concepts can be used interchangeably across a wide range of information retrieval applications. skos:exactMatch is a transitive property, and is a sub-property of skos:closeMatch.
comment: skos:exactMatch is disjoint with each of the properties skos:broadMatch and skos:relatedMatch.

has related
sub property of: semanticRelation
definition: Relates a concept to a concept with which there is an associative semantic relationship.
comment: skos:related is disjoint with skos:broaderTransitive

is in scheme
definition: Relates a resource (for example a concept) to a concept scheme in which it is included.

Descriptor
type: Class

useInsteadNote
sub property of: note
definition: For an aspect of the current concept use the concept to which the note points instead of the current.
comment: The note consists of a blank node. It contains a rdfs:value literal which designates the aspect and a rdfs:seeAlso link to the concept which should be used instead.

STW Thesaurus for Economics
label: Standard-Thesaurus Wirtschaft @de
type: Dataset
type: ConceptScheme

Concept
type: Class

scope note
sub property of: note
definition: A note that helps to clarify the meaning and/or the use of a concept.