Meat
in scheme: pr
scope note: (einschl.: Fleischwaren, Schlachthof) @de
preferred label: Fleisch @de
broader: http://zbw.eu/beta/pm20voc/pr/i/72234
type: Concept
notation: LW05-Fl
NotationLong: LW05-Fl

NotationLong
sub property of: notation
definition: EXPERIMENTAL: Notation with blanks and leading zeros for sortability.