High technology
notation: ID03
preferred label: Hochtechnologiesektor @de
NotationLong: ID03
broader: http://zbw.eu/beta/pm20voc/pr/i/126593
scope note: (einschl.: Technologiezentrum, Verbundwerkstoff) @de
type: Concept
in scheme: pr

NotationLong
sub property of: notation
definition: EXPERIMENTAL: Notation with blanks and leading zeros for sortability.