NotationLong
sub property of: notation
definition: EXPERIMENTAL: Notation with blanks and leading zeros for sortability.

Baby product
scope note: (einschl.: Babynahrung, Babypflegemittel) @de
preferred label: Babyartikel @de
notation: ID04-Ba
in scheme: pr
broader: http://zbw.eu/beta/pm20voc/pr/i/73055
type: Concept
NotationLong: ID04-Ba