Musical instrument
preferred label: Musikinstrument @de
NotationLong: ID04-Mu
scope note: (einschl.: Elektronisches Musikinstrument) @de
in scheme: pr
notation: ID04-Mu
broader: http://zbw.eu/beta/pm20voc/pr/i/73055
type: Concept

NotationLong
sub property of: notation
definition: EXPERIMENTAL: Notation with blanks and leading zeros for sortability.