Machinery industry
narrower: http://zbw.eu/beta/pm20voc/pr/i/72976
narrower: http://zbw.eu/beta/pm20voc/pr/i/72995
narrower: http://zbw.eu/beta/pm20voc/pr/i/72985
narrower: http://zbw.eu/beta/pm20voc/pr/i/72996
narrower: http://zbw.eu/beta/pm20voc/pr/i/72990
narrower: http://zbw.eu/beta/pm20voc/pr/i/72986
narrower: http://zbw.eu/beta/pm20voc/pr/i/72980
narrower: http://zbw.eu/beta/pm20voc/pr/i/72974
narrower: http://zbw.eu/beta/pm20voc/pr/i/72999
narrower: http://zbw.eu/beta/pm20voc/pr/i/72993
narrower: http://zbw.eu/beta/pm20voc/pr/i/72989
narrower: http://zbw.eu/beta/pm20voc/pr/i/72983
narrower: http://zbw.eu/beta/pm20voc/pr/i/72994
narrower: http://zbw.eu/beta/pm20voc/pr/i/72984
narrower: http://zbw.eu/beta/pm20voc/pr/i/72977
narrower: http://zbw.eu/beta/pm20voc/pr/i/72978
narrower: http://zbw.eu/beta/pm20voc/pr/i/72997
narrower: http://zbw.eu/beta/pm20voc/pr/i/72991
narrower: http://zbw.eu/beta/pm20voc/pr/i/72987
narrower: http://zbw.eu/beta/pm20voc/pr/i/72981
narrower: http://zbw.eu/beta/pm20voc/pr/i/72998
narrower: http://zbw.eu/beta/pm20voc/pr/i/73000
narrower: http://zbw.eu/beta/pm20voc/pr/i/72992
narrower: http://zbw.eu/beta/pm20voc/pr/i/72988
narrower: http://zbw.eu/beta/pm20voc/pr/i/72979
narrower: http://zbw.eu/beta/pm20voc/pr/i/72982
narrower: http://zbw.eu/beta/pm20voc/pr/i/72975
scope note: (einschl.: Anlagenbau, Maschinenbauprodukt, Gebrauchtmaschine) @de
preferred label: Maschinenbau @de
in scheme: pr
notation: ID08
broader: http://zbw.eu/beta/pm20voc/pr/i/126593
NotationLong: ID08
type: Concept

NotationLong
sub property of: notation
definition: EXPERIMENTAL: Notation with blanks and leading zeros for sortability.