Agricultural machinery
scope note: (einschl.: Landwirtschaftliches Gerät, Gartenmaschine) @de
label: Landmaschine @de
in scheme: pr
broader: http://zbw.eu/beta/pm20voc/pr/i/73004
type: Concept
notation: ID08-Ld
NotationLong: ID08-Ld

NotationLong
sub property of: notation
definition: EXPERIMENTAL: Notation with blanks and leading zeros for sortability.