Vehicle Construction
type: Concept
label: Fahrzeugbau @de
narrower: http://zbw.eu/beta/pm20voc/pr/i/72971
narrower: http://zbw.eu/beta/pm20voc/pr/i/72953
narrower: http://zbw.eu/beta/pm20voc/pr/i/72972
narrower: http://zbw.eu/beta/pm20voc/pr/i/72965
narrower: http://zbw.eu/beta/pm20voc/pr/i/72970
narrower: http://zbw.eu/beta/pm20voc/pr/i/72954
NotationLong: ID09
in scheme: pr
scope note: (einschl.: Verkehrsmittel, Landfahrzeug) @de
notation: ID09
broader: http://zbw.eu/beta/pm20voc/pr/i/126593

NotationLong
sub property of: notation
definition: EXPERIMENTAL: Notation with blanks and leading zeros for sortability.