NotationLong
sub property of: notation
definition: EXPERIMENTAL: Notation with blanks and leading zeros for sortability.

Rolling stock
in scheme: pr
preferred label: Schienenfahrzeug @de
broader: http://zbw.eu/beta/pm20voc/pr/i/72973
scope note: (einschl.: Rollendes Eisenbahnmaterial) @de
type: Concept
NotationLong: ID09-Sf
notation: ID09-Sf