NotationLong
sub property of: notation
definition: EXPERIMENTAL: Notation with blanks and leading zeros for sortability. @en

Messtechnisches Gerät
scope note: (einschl.: Elektrisches und elektronsiches Messgerät, prüftechnisches und regeltechnisches Gerät, Sensor, steuerungstechnisches Gerät)
broader: http://zbw.eu/beta/pm20voc/pr/i/72948
notation: ID10-Mt
NotationLong: ID10-Mt
in scheme: pr
type: Concept