NotationLong
sub property of: notation
definition: EXPERIMENTAL: Notation with blanks and leading zeros for sortability. @en

Computer
NotationLong: ID11.02-Co
type: Concept
broader: http://zbw.eu/beta/pm20voc/pr/i/72908
scope note: (einschl.: Datenverarbeitungsanlage, Drucker, Eingabegerät, Hardware)
in scheme: pr
notation: ID11.02-Co