NotationLong
sub property of: notation
definition: EXPERIMENTAL: Notation with blanks and leading zeros for sortability.

Data storage device
label: Datenträger @de
NotationLong: ID11.02-Dt
notation: ID11.02-Dt
type: Concept
scope note: (einschl.: Speicher (Datenverarbeitung), Chipkarte) @de
in scheme: pr
broader: http://zbw.eu/beta/pm20voc/pr/i/72908