NotationLong
sub property of: notation
definition: EXPERIMENTAL: Notation with blanks and leading zeros for sortability.

Photographic product
type: Concept
in scheme: pr
NotationLong: ID12-Fo
broader: http://zbw.eu/beta/pm20voc/pr/i/72899
label: Fototechnisches Produkt @de
notation: ID12-Fo
scope note: (einschl.: Fotoapparat, Filmkamera, Filmprojektor) @de