NotationLong
sub property of: notation
definition: EXPERIMENTAL: Notation with blanks and leading zeros for sortability.

Food additive
label: Lebensmittelchemikalie @de
NotationLong: ID13-Lm
notation: ID13-Lm
scope note: (einschl.: Lebensmittelkonservierungsstoff, Lebensmittelzusatzstoff) @de
type: Concept
broader: http://zbw.eu/beta/pm20voc/pr/i/72895
in scheme: pr