NotationLong
sub property of: notation
definition: EXPERIMENTAL: Notation with blanks and leading zeros for sortability.

War damage
preferred label: Kriegsschaden @de
broader: http://zbw.eu/beta/pm20voc/pr/i/72847
notation: PO04.02
in scheme: pr
NotationLong: PO04.02
scope note: (einschl.: Besatzungsschaden, Kriegsopferfürsorge, Kriegsgräberfürsorge) @de
type: Concept