NotationLong
sub property of: notation
definition: EXPERIMENTAL: Notation with blanks and leading zeros for sortability.

Braided goods
label: Flechtwaren @de
broader: http://zbw.eu/beta/pm20voc/pr/i/72804
type: Concept
notation: ID16-Fl
NotationLong: ID16-Fl
scope note: (einschl.: Besen, Bürste, Korbwaren, Pinsel) @de
in scheme: pr