Fibre
scope note: (einschl.: Chemiefaser, Cellulosefaser) @de
NotationLong: ID19-Fa
broader: http://zbw.eu/beta/pm20voc/pr/i/72791
preferred label: Faser @de
type: Concept
notation: ID19-Fa
in scheme: pr

NotationLong
sub property of: notation
definition: EXPERIMENTAL: Notation with blanks and leading zeros for sortability.