NotationLong
sub property of: notation
definition: EXPERIMENTAL: Notation with blanks and leading zeros for sortability.

Economic Law
NotationLong: RE02
narrower: http://zbw.eu/beta/pm20voc/pr/i/72693
narrower: http://zbw.eu/beta/pm20voc/pr/i/72695
editorial note: Für Gesellschaftsrecht vgl. aber: Rechtsform im Feld Betriebswirtschaft @de
label: Wirtschaftsrecht @de
in scheme: pr
broader: http://zbw.eu/beta/pm20voc/pr/i/126756
notation: RE02
scope note: (einschl.: Außenhandelsrecht, Außenwirtschaftsrecht, Handelsrecht, Schiedsgerichtsbarkeit in Handelssachen, Gewerberecht) @de
type: Concept