Nature conservation
scope note: (einschl.: Landschaftspflege, Landschaftsschutz, Artenschutz, Pflanzenschutz) @de
in scheme: pr
preferred label: Naturschutz @de
broader: http://zbw.eu/beta/pm20voc/pr/i/72686
narrower: http://zbw.eu/beta/pm20voc/pr/i/72682
narrower: http://zbw.eu/beta/pm20voc/pr/i/72683
notation: NU02.02
NotationLong: NU02.02
type: Concept

NotationLong
sub property of: notation
definition: EXPERIMENTAL: Notation with blanks and leading zeros for sortability.