NotationLong
sub property of: notation
definition: EXPERIMENTAL: Notation with blanks and leading zeros for sortability.

Costal zone management
label: Küstenschutz @de
broader: http://zbw.eu/beta/pm20voc/pr/i/72684
in scheme: pr
NotationLong: NU02.02.02
type: Concept
notation: NU02.02.02
scope note: (einschl.: Meeresdeichbau, Landgewinnung, Uferschutz von Flüssen) @de