NotationLong
sub property of: notation
definition: EXPERIMENTAL: Notation with blanks and leading zeros for sortability.

Radiation protection
NotationLong: NU02.07
type: Concept
notation: NU02.07
scope note: (ausschl.: Für radioaktiver Abfall vgl. aber: nukleare Entsorgung) (einschl.: Strahlenbelastung, Elektrosmog) @de
label: Strahlenschutz @de
broader: http://zbw.eu/beta/pm20voc/pr/i/72686
in scheme: pr