Technology
preferred label: Technologie @de
broader: http://zbw.eu/beta/pm20voc/pr/i/126740
NotationLong: FO08
scope note: (einschl.: Technik, Technische Wissenschaft, Ingenieurwissenschaften) @de
type: Concept
notation: FO08
in scheme: pr

NotationLong
sub property of: notation
definition: EXPERIMENTAL: Notation with blanks and leading zeros for sortability.