NotationLong
sub property of: notation
definition: EXPERIMENTAL: Notation with blanks and leading zeros for sortability. @en

Wissenschaft und Forschung
scope note: (einschl.: Grundlagenforschung, Forschung und Entwicklung)
broader: http://zbw.eu/beta/pm20voc/pr/i/126740
notation: FO00
NotationLong: FO00
in scheme: pr
type: Concept