NotationLong
sub property of: notation
definition: EXPERIMENTAL: Notation with blanks and leading zeros for sortability.

International technology cooperation
label: Internationale technische Zusammenarbeit @de
notation: FO01
NotationLong: FO01
type: Concept
broader: http://zbw.eu/beta/pm20voc/pr/i/126740
scope note: (einschl.: Internationale wissenschaftlich(-technische) Zusammenarbeit) @de
in scheme: pr