Politische Wissenschaft
scope note: (einschl.: Forschung über internationale Beziehungen und Systemvergleiche, Friedensforschung)
broader: http://zbw.eu/beta/pm20voc/pr/i/72669
notation: FO03.02
NotationLong: FO03.02
in scheme: pr
type: Concept

NotationLong
sub property of: notation
definition: EXPERIMENTAL: Notation with blanks and leading zeros for sortability. @en