NotationLong
sub property of: notation
definition: EXPERIMENTAL: Notation with blanks and leading zeros for sortability.

Natural sciences
label: Naturwissenschaft @de
in scheme: pr
scope note: (einschl.: Physik, Chemie, Biologie) @de
narrower: http://zbw.eu/beta/pm20voc/pr/i/72663
broader: http://zbw.eu/beta/pm20voc/pr/i/126740
type: Concept
NotationLong: FO06
notation: FO06