NotationLong
sub property of: notation
definition: EXPERIMENTAL: Notation with blanks and leading zeros for sortability.

Service
label: Dienstleistung @de
broader: http://zbw.eu/beta/pm20voc/pr/i/126618
in scheme: pr
type: Concept
scope note: (einschl.: Dienstleistungsbranche, Dienstleistungsgesellschaft) @de
NotationLong: DL00
notation: DL00