Cultural cooperation
label: Kulturelle Beziehungen @de
notation: KU01
type: Concept
in scheme: pr
scope note: (einschl.: Auswärtige Kulturpolitik, Kulturaustausch, Städtepartnerschaft) @de
NotationLong: KU01
broader: http://zbw.eu/beta/pm20voc/pr/i/126729

NotationLong
sub property of: notation
definition: EXPERIMENTAL: Notation with blanks and leading zeros for sortability.