Vergnügungspark
scope note: (einschl.: Themenpark, Freizeitpark, Schausteller, Zirkus)
broader: http://zbw.eu/beta/pm20voc/pr/i/72654
notation: DL01.02
NotationLong: DL01.02
in scheme: pr
type: Concept

NotationLong
sub property of: notation
definition: EXPERIMENTAL: Notation with blanks and leading zeros for sortability. @en