NotationLong
sub property of: notation
definition: EXPERIMENTAL: Notation with blanks and leading zeros for sortability.

Music industry
preferred label: Musikwirtschaft @de
broader: http://zbw.eu/beta/pm20voc/pr/i/126729
NotationLong: KU04
editorial note: Tonträgerindustrie nur wenn zusammen mit anderen musikwirtschaftlichen Akteuren thematisiert @de
notation: KU04
type: Concept
scope note: (einschl.: Konzertveranstalter, Musikverlag, Tonträgerindustrie, Sprechtheater, Musiktheater, Tanztheater) @de
in scheme: pr