NotationLong
sub property of: notation
definition: EXPERIMENTAL: Notation with blanks and leading zeros for sortability.

Temporary agency work
scope note: Zeitarbeit als Leiharbeit (einschl.: Zeitarbeitsbranche) @de
broader: http://zbw.eu/beta/pm20voc/pr/i/72642
NotationLong: DL02.02
preferred label: Leiharbeit @de
notation: DL02.02
in scheme: pr
type: Concept