Advertising Industry
broader: http://zbw.eu/beta/pm20voc/pr/i/72631
label: Werbewirtschaft @de
scope note: (einschl.: Werbeagentur, PR-Agentur) @de
NotationLong: DL04.01
in scheme: pr
notation: DL04.01
type: Concept

NotationLong
sub property of: notation
definition: EXPERIMENTAL: Notation with blanks and leading zeros for sortability.