NotationLong
sub property of: notation
definition: EXPERIMENTAL: Notation with blanks and leading zeros for sortability.

Long-term care insurance
preferred label: Pflegeversicherung @de
type: Concept
NotationLong: SO08.02.01
notation: SO08.02.01
scope note: (einschl.: Gesetzliche und private Pflegeversicherung) @de
in scheme: pr
broader: http://zbw.eu/beta/pm20voc/pr/i/72611