Sales representatives
broader: http://zbw.eu/beta/pm20voc/pr/i/126641
notation: HA01
scope note: umfaßt alle Arten der Handelsvermittlung, sowohl selbständige Handelsvertreter/innen und Handelsmarkler/innen als auch angestellte Mitarbeiter/innen @de
label: Handelsvertretung @de
in scheme: pr
NotationLong: HA01
type: Concept

NotationLong
sub property of: notation
definition: EXPERIMENTAL: Notation with blanks and leading zeros for sortability.