NotationLong
sub property of: notation
definition: EXPERIMENTAL: Notation with blanks and leading zeros for sortability.

Retail Trade
narrower: http://zbw.eu/beta/pm20voc/pr/i/72590
narrower: http://zbw.eu/beta/pm20voc/pr/i/72600
narrower: http://zbw.eu/beta/pm20voc/pr/i/72603
narrower: http://zbw.eu/beta/pm20voc/pr/i/72586
narrower: http://zbw.eu/beta/pm20voc/pr/i/72591
narrower: http://zbw.eu/beta/pm20voc/pr/i/72601
narrower: http://zbw.eu/beta/pm20voc/pr/i/72592
narrower: http://zbw.eu/beta/pm20voc/pr/i/72585
narrower: http://zbw.eu/beta/pm20voc/pr/i/72587
notation: HA03
label: Einzelhandel @de
broader: http://zbw.eu/beta/pm20voc/pr/i/126641
in scheme: pr
scope note: (einschl.: Nachbarschaftsladen, Facheinzelhandel, Verkauf durch Warenautomat) @de
type: Concept
NotationLong: HA03