Unfallversicherung
editorial note: Gesetzliche und private Unfallversicherung
notation: SO08.03
label: Accident insurance @en
NotationLong: SO08.03
broader: http://zbw.eu/beta/pm20voc/pr/i/72615
in scheme: pr
scope note: (einschl.: Gesetzliche Unfallversicherung)
type: Concept

NotationLong
sub property of: notation
definition: EXPERIMENTAL: Notation with blanks and leading zeros for sortability. @en