Banking interests
in scheme: pr
notation: BK01.03
preferred label: Bankbeteiligung @de
type: Concept
NotationLong: BK01.03
scope note: (einschl.: Anteilsbesitz der Banken) @de
broader: http://zbw.eu/beta/pm20voc/pr/i/72497

NotationLong
sub property of: notation
definition: EXPERIMENTAL: Notation with blanks and leading zeros for sortability.