NotationLong
sub property of: notation
definition: EXPERIMENTAL: Notation with blanks and leading zeros for sortability.

Big bank
label: Großbank @de
in scheme: pr
scope note: (einschl.: Regionalbank, Investment Bank) @de
type: Concept
NotationLong: BK01.05
notation: BK01.05
broader: http://zbw.eu/beta/pm20voc/pr/i/72497