NotationLong
sub property of: notation
definition: EXPERIMENTAL: Notation with blanks and leading zeros for sortability.

Credit cooperative
type: Concept
preferred label: Kreditgenossenschaft @de
in scheme: pr
scope note: (einschl.: Landwirtschaftsbank, Gemeinwirtschaftsbank, Ökobank) @de
NotationLong: BK01.10
broader: http://zbw.eu/beta/pm20voc/pr/i/72497
notation: BK01.10