NotationLong
sub property of: notation
definition: EXPERIMENTAL: Notation with blanks and leading zeros for sortability.

Postal banking
broader: http://zbw.eu/beta/pm20voc/pr/i/72497
label: Postbankdienst @de
in scheme: pr
notation: BK01.11
type: Concept
scope note: (einschl.: Postscheckdienst, Postsparkasse) @de
NotationLong: BK01.11