Investmentgesellschaft
scope note: (einschl.: Investmentfond, Investmentsparen)
broader: http://zbw.eu/beta/pm20voc/pr/i/72497
notation: BK01.12
NotationLong: BK01.12
in scheme: pr
type: Concept

NotationLong
sub property of: notation
definition: EXPERIMENTAL: Notation with blanks and leading zeros for sortability. @en