NotationLong
sub property of: notation
definition: EXPERIMENTAL: Notation with blanks and leading zeros for sortability.

Banking automation
notation: BK01.13
preferred label: Bankautomation @de
type: Concept
in scheme: pr
NotationLong: BK01.13
scope note: (einschl.: Telefonbanking, Homebanking, Bargeldautomat, Kontostandautomat, Electronic Cash, Point-of-sale Systeme) @de
broader: http://zbw.eu/beta/pm20voc/pr/i/72497