NotationLong
sub property of: notation
definition: EXPERIMENTAL: Notation with blanks and leading zeros for sortability.

Collateral (Security)
NotationLong: BK02.01
preferred label: Kreditsicherung @de
type: Concept
scope note: (einschl.: Gläubigerschutz, Leihhaus, Inkassoverkehr, Wechsel) @de
broader: http://zbw.eu/beta/pm20voc/pr/i/72477
in scheme: pr
notation: BK02.01