NotationLong
sub property of: notation
definition: EXPERIMENTAL: Notation with blanks and leading zeros for sortability.

Insurance Industry
label: Versicherungswesen @de
in scheme: pr
notation: VS00
scope note: (einschl.: Ausländische Versicherungsgesellschaft, Versicherungsökonomie, Vermögensanlage) @de
broader: http://zbw.eu/beta/pm20voc/pr/i/126671
type: Concept
NotationLong: VS00