Life insurance
label: Lebensversicherung @de
scope note: (einschl.: Private Rentenversicherung) @de
notation: VS04
broader: http://zbw.eu/beta/pm20voc/pr/i/126671
type: Concept
in scheme: pr
NotationLong: VS04

NotationLong
sub property of: notation
definition: EXPERIMENTAL: Notation with blanks and leading zeros for sortability.