NotationLong
sub property of: notation
definition: EXPERIMENTAL: Notation with blanks and leading zeros for sortability.

Private health insurance
scope note: (einschl.: Private Pflegeversicherung, Private Unfallversicherung, Private Berufsunfähigkeitsversicherung) @de
in scheme: pr
label: Private Krankenversicherung @de
NotationLong: VS05
broader: http://zbw.eu/beta/pm20voc/pr/i/126671
type: Concept
notation: VS05