NotationLong
sub property of: notation
definition: EXPERIMENTAL: Notation with blanks and leading zeros for sortability.

Administrative reform
label: Verwaltungsreform @de
type: Concept
notation: OV01
in scheme: pr
broader: http://zbw.eu/beta/pm20voc/pr/i/126689
NotationLong: OV01
scope note: (einschl.: Betriebswirtschaftliche Verwaltungsorganisation) @de