Military procurement
label: Militärische Beschaffung @de
in scheme: pr
broader: http://zbw.eu/beta/pm20voc/pr/i/72438
scope note: Beschaffung der gesamten militärischen Ausrüstung (ausschl.: für Außenhandel mit Rüstungsgütern vgl. aber: Rüstungsindustrie) @de
type: Concept
NotationLong: OV06.02
notation: OV06.02

NotationLong
sub property of: notation
definition: EXPERIMENTAL: Notation with blanks and leading zeros for sortability.