NotationLong
sub property of: notation
definition: EXPERIMENTAL: Notation with blanks and leading zeros for sortability.

Chamber of commerce
label: Handelskammer @de
scope note: (einschl.: Industrie- und Handelskammer, Kammerwesen) @de
NotationLong: NP01.01
in scheme: pr
type: Concept
broader: http://zbw.eu/beta/pm20voc/pr/i/72431
notation: NP01.01