Cooperative
preferred label: Genossenschaft @de
type: Concept
in scheme: pr
NotationLong: NP02
scope note: (einschl.: Genossensschaftswesen, Einkaufsgenossenschaft, Konsumgenossenschaft, Produktionsgenossenschaft, Verkehrsgenossenschaft) @de
broader: http://zbw.eu/beta/pm20voc/pr/i/126698
notation: NP02

NotationLong
sub property of: notation
definition: EXPERIMENTAL: Notation with blanks and leading zeros for sortability.